Reaction Details
TargetAlkaline phosphatase, germ cell type
LigandBDBM41892
Substrate/Competitorn/a
Meas. Tech.Luminescent assay for HTS discovery of chemical inhibitors of placental alkaline phosphatase confirmation
IC50 2920±n/a nM
Citation PubChem, PC Luminescent assay for HTS discovery of chemical inhibitors of placental alkaline phosphatase confirmation PubChem Bioassay(2009)[AID]
 
Alkaline phosphatase, germ cell type
Name:Alkaline phosphatase, germ cell type
Type:PROTEIN
Mol. Mass.:57374.31
Organism:Homo sapiens (Human)
Description:ChEMBL_29964
Residue:532
BDBM41892
NameBDBM41892
Synonyms:1-(3,4-dihydroxyphenyl)-2-[(4-prop-2-enyl-5-pyridin-3-yl-1,2,4-triazol-3-yl)sulfanyl]ethanone 1-[3,4-bis(oxidanyl)phenyl]-2-[(4-prop-2-enyl-5-pyridin-3-yl-1,2,4-triazol-3-yl)sulfanyl]ethanone MLS-0297802.0001 | cid_1400947
TypeSmall organic molecule
Emp. Form.C18H16N4O3S
Mol. Mass.368.41
SMILESOc1ccc(cc1O)C(=O)CSc1nnc(-c2cccnc2)n1CC=C