Reaction Details
TargetAlkaline phosphatase, germ cell type
LigandBDBM34274
Substrate/Competitorn/a
Meas. Tech.Luminescent assay for HTS discovery of chemical inhibitors of placental alkaline phosphatase confirmation
IC50 2790±n/a nM
Citation PubChem, PC Luminescent assay for HTS discovery of chemical inhibitors of placental alkaline phosphatase confirmation PubChem Bioassay(2009)[AID]
 
Alkaline phosphatase, germ cell type
Name:Alkaline phosphatase, germ cell type
Type:PROTEIN
Mol. Mass.:57374.31
Organism:Homo sapiens (Human)
Description:ChEMBL_29964
Residue:532
BDBM34274
NameBDBM34274
Synonyms:1-(3,4-dihydroxyphenyl)-2-[[5-(2-methoxyphenyl)-4-prop-2-enyl-1,2,4-triazol-3-yl]sulfanyl]ethanone 1-[3,4-bis(oxidanyl)phenyl]-2-[[5-(2-methoxyphenyl)-4-prop-2-enyl-1,2,4-triazol-3-yl]sulfanyl]ethanone MLS000080519 cid_665093
TypeSmall organic molecule
Emp. Form.C20H19N3O4S
Mol. Mass.397.448
SMILESCOc1ccccc1-c1nnc(SCC(=O)c2ccc(O)c(O)c2)n1CC=C