Reaction Details
TargetEukaryotic translation initiation factor 2-alpha kinase 3
LigandBDBM46439
Substrate/Competitorn/a
Meas. Tech.Dose response cell-based high-throughput screening assay to measure PERK inhibition
EC50>55700±n/a nM
Citation PubChem, PC Dose response cell-based high-throughput screening assay to measure PERK inhibition PubChem Bioassay(2009)[AID]
 
Eukaryotic translation initiation factor 2-alpha kinase 3
Name:Eukaryotic translation initiation factor 2-alpha kinase 3
Type:Enzyme
Mol. Mass.:125190.66
Organism:Homo sapiens (Human)
Description:Q9NZJ5
Residue:1116
BDBM46439
NameBDBM46439
Synonyms:(4-Hydroxy-3-methoxy-phenyl)-morpholin-4-yl-acetonitrile 2-(4-hydroxy-3-methoxy-phenyl)-2-morpholino-acetonitrile 2-(4-hydroxy-3-methoxyphenyl)-2-morpholin-4-ylacetonitrile SMR000010095 | cid_652654
TypeSmall organic molecule
Emp. Form.C13H16N2O3
Mol. Mass.248.2777
SMILESCOc1cc(ccc1O)C(C#N)N1CCOCC1