Reaction Details
TargetEukaryotic translation initiation factor 2-alpha kinase 3
LigandBDBM46448
Substrate/Competitorn/a
Meas. Tech.Dose response cell-based high-throughput screening assay to measure PERK inhibition
EC50>55700±n/a nM
Citation PubChem, PC Dose response cell-based high-throughput screening assay to measure PERK inhibition PubChem Bioassay(2009)[AID]
 
Eukaryotic translation initiation factor 2-alpha kinase 3
Name:Eukaryotic translation initiation factor 2-alpha kinase 3
Type:Enzyme
Mol. Mass.:125190.66
Organism:Homo sapiens (Human)
Description:Q9NZJ5
Residue:1116
BDBM46448
NameBDBM46448
Synonyms:2-[(4-methylphenyl)amino]-2-oxoethyl 3-(2-oxo-2,3-dihydro-1H-imidazol-4-yl)propanoate 3-(2-oxo-1,3-dihydroimidazol-4-yl)propanoic acid [2-(4-methylanilino)-2-oxoethyl] ester SMR000072249 [2-[(4-methylphenyl)amino]-2-oxidanylidene-ethyl] 3-(2-oxidanylidene-1,3-dihydroimidazol-4-yl)propanoate | cid_753474
TypeSmall organic molecule
Emp. Form.C15H17N3O4
Mol. Mass.303.3132
SMILESCc1ccc(NC(=O)COC(=O)CCc2c[nH]c(=O)[nH]2)cc1