Reaction Details
TargetEukaryotic translation initiation factor 2-alpha kinase 3
LigandBDBM46453
Substrate/Competitorn/a
Meas. Tech.Dose response cell-based high-throughput screening assay to measure PERK inhibition
EC50>55700±n/a nM
Citation PubChem, PC Dose response cell-based high-throughput screening assay to measure PERK inhibition PubChem Bioassay(2009)[AID]
 
Eukaryotic translation initiation factor 2-alpha kinase 3
Name:Eukaryotic translation initiation factor 2-alpha kinase 3
Type:Enzyme
Mol. Mass.:125190.66
Organism:Homo sapiens (Human)
Description:Q9NZJ5
Residue:1116
BDBM46453
NameBDBM46453
Synonyms:1,3-benzodioxol-5-yl-(3,5-dimethyl-1-pyrazolyl)methanone MLS000110735 cid_686254
TypeSmall organic molecule
Emp. Form.C13H12N2O3
Mol. Mass.244.246
SMILESCc1cc(C)n(n1)C(=O)c1ccc2OCOc2c1