Reaction Details
TargetEukaryotic translation initiation factor 2-alpha kinase 3
LigandBDBM46454
Substrate/Competitorn/a
Meas. Tech.Dose response cell-based high-throughput screening assay to measure PERK inhibition
EC50>55700±n/a nM
Citation PubChem, PC Dose response cell-based high-throughput screening assay to measure PERK inhibition PubChem Bioassay(2009)[AID]
 
Eukaryotic translation initiation factor 2-alpha kinase 3
Name:Eukaryotic translation initiation factor 2-alpha kinase 3
Type:Enzyme
Mol. Mass.:125190.66
Organism:Homo sapiens (Human)
Description:Q9NZJ5
Residue:1116
BDBM46454
NameBDBM46454
Synonyms:(4-Oxo-3,4-dihydro-phthalazin-1-yl)-acetic acid methyl ester 2-(4-oxo-3H-phthalazin-1-yl)acetic acid methyl ester SMR000124999 methyl 2-(4-oxidanylidene-3H-phthalazin-1-yl)ethanoate | methyl 2-(4-oxo-3H-phthalazin-1-yl)acetate
TypeSmall organic molecule
Emp. Form.C11H10N2O3
Mol. Mass.218.2087
SMILESCOC(=O)Cc1n[nH]c(=O)c2ccccc12