Reaction Details
TargetMannose-6-phosphate isomerase
LigandBDBM46606
Substrate/Competitorn/a
Meas. Tech.Confirmation of compounds inhibiting phosphomannose isomerase (PMI) via a fluorescence intensity assay.
IC50 3890±n/a nM
Citation PubChem, PC Confirmation of compounds inhibiting phosphomannose isomerase (PMI) via a fluorescence intensity assay. PubChem Bioassay(2010)[AID]
 
Mannose-6-phosphate isomerase
Name:Mannose-6-phosphate isomerase
Type:PROTEIN
Mol. Mass.:46651.35
Organism:Homo sapiens (Human)
Description:ChEMBL_1448919
Residue:423
BDBM46606
NameBDBM46606
Synonyms:5-(2,3-dihydro-1,4-benzodioxin-3-yl)-1,2-dihydro-1,2,4-triazole-3-thione cid_2835294
TypeSmall organic molecule
Emp. Form.C10H9N3O2S
Mol. Mass.235.262
SMILESS=c1[nH]nc([nH]1)C1COc2ccccc2O1