Reaction Details
TargetMannose-6-phosphate isomerase
LigandBDBM46677
Substrate/Competitorn/a
Meas. Tech.Confirmation of compounds inhibiting phosphomannose isomerase (PMI) via a fluorescence intensity assay.
IC50 3520±n/a nM
Citation PubChem, PC Confirmation of compounds inhibiting phosphomannose isomerase (PMI) via a fluorescence intensity assay. PubChem Bioassay(2010)[AID]
 
Mannose-6-phosphate isomerase
Name:Mannose-6-phosphate isomerase
Type:PROTEIN
Mol. Mass.:46651.35
Organism:Homo sapiens (Human)
Description:ChEMBL_1448919
Residue:423
BDBM46677
NameBDBM46677
Synonyms:(4-chlorodithiazol-5-ylidene)-(2,4-dinitrophenyl)amine 4-chloro-N-(2,4-dinitrophenyl)-5-dithiazolimine MLS-0390820.0001 | cid_3919997
TypeSmall organic molecule
Emp. Form.C8H3ClN4O4S2
Mol. Mass.318.717
SMILES[O-][N+](=O)c1ccc(\N=c2/ssnc2Cl)c(c1)[N+]([O-])=O