Reaction Details
TargetMannose-6-phosphate isomerase
LigandBDBM46732
Substrate/Competitorn/a
Meas. Tech.Confirmation of compounds inhibiting phosphomannose isomerase (PMI) via a fluorescence intensity assay.
IC50 1770±n/a nM
Citation PubChem, PC Confirmation of compounds inhibiting phosphomannose isomerase (PMI) via a fluorescence intensity assay. PubChem Bioassay(2010)[AID]
 
Mannose-6-phosphate isomerase
Name:Mannose-6-phosphate isomerase
Type:PROTEIN
Mol. Mass.:46651.35
Organism:Homo sapiens (Human)
Description:ChEMBL_1448919
Residue:423
BDBM46732
NameBDBM46732
Synonyms:2-(4-chlorophenyl)-5-fluoranyl-1,2-benzothiazol-3-one MLS-0390975.0001 | cid_25241618
TypeSmall organic molecule
Emp. Form.C13H7ClFNOS
Mol. Mass.279.717
SMILESFc1ccc2sn(-c3ccc(Cl)cc3)c(=O)c2c1