Reaction Details
TargetMucolipin-3
LigandBDBM46818
Substrate/Competitorn/a
Meas. Tech.Dose response cell-based high-throughput screening assay for agonists of the transient receptor potential channel ML3 (TRPML3)
EC50 1160±n/a nM
Citation PubChem, PC Dose response cell-based high-throughput screening assay for agonists of the transient receptor potential channel ML3 (TRPML3) PubChem Bioassay(2009)[AID]
 
Mucolipin-3
Name:Mucolipin-3
Type:Enzyme Catalytic Domain
Mol. Mass.:64244.09
Organism:Homo sapiens (Human)
Description:Q8TDD5
Residue:553
BDBM46818
NameBDBM46818
Synonyms:MLS000074627 N-cyclopropyl-4-(2-ethylpiperidin-1-yl)sulfonyl-N-(thiophen-2-ylmethyl)benzenesulfonamide N-cyclopropyl-4-[(2-ethyl-1-piperidinyl)sulfonyl]-N-(thiophen-2-ylmethyl)benzenesulfonamide cid_645530
TypeSmall organic molecule
Emp. Form.C21H28N2O4S3
Mol. Mass.468.653
SMILESCCC1CCCCN1S(=O)(=O)c1ccc(cc1)S(=O)(=O)N(Cc1cccs1)C1CC1