Reaction Details
TargetMucolipin-3
LigandBDBM46831
Substrate/Competitorn/a
Meas. Tech.Dose response cell-based high-throughput screening assay for agonists of the transient receptor potential channel ML3 (TRPML3)
EC50 5150±n/a nM
Citation PubChem, PC Dose response cell-based high-throughput screening assay for agonists of the transient receptor potential channel ML3 (TRPML3) PubChem Bioassay(2009)[AID]
 
Mucolipin-3
Name:Mucolipin-3
Type:Enzyme Catalytic Domain
Mol. Mass.:64244.09
Organism:Homo sapiens (Human)
Description:Q8TDD5
Residue:553
BDBM46831
NameBDBM46831
Synonyms:1-tert-butyl-3-methyl-4-[(4-methylphenyl)sulfonyl]-1H-pyrazol-5-yl pivalate 2,2-dimethylpropionic acid (2-tert-butyl-5-methyl-4-tosyl-pyrazol-3-yl) ester SMR000025366 [2-tert-butyl-5-methyl-4-(4-methylphenyl)sulfonylpyrazol-3-yl] 2,2-dimethylpropanoate | cid_3240536
TypeSmall organic molecule
Emp. Form.C20H28N2O4S
Mol. Mass.392.512
SMILESCc1nn(c(OC(=O)C(C)(C)C)c1S(=O)(=O)c1ccc(C)cc1)C(C)(C)C