Reaction Details
TargetMucolipin-3
LigandBDBM46857
Substrate/Competitorn/a
Meas. Tech.Dose response cell-based high-throughput screening assay for agonists of the transient receptor potential channel ML3 (TRPML3)
EC50 7220±n/a nM
Citation PubChem, PC Dose response cell-based high-throughput screening assay for agonists of the transient receptor potential channel ML3 (TRPML3) PubChem Bioassay(2009)[AID]
 
Mucolipin-3
Name:Mucolipin-3
Type:Enzyme Catalytic Domain
Mol. Mass.:64244.09
Organism:Homo sapiens (Human)
Description:Q8TDD5
Residue:553
BDBM46857
NameBDBM46857
Synonyms:4,4-dimethyl-3-(4-methylphenyl)sulfonyl-1,3-thiazolidine-2-thione 4,4-dimethyl-3-tosyl-thiazolidine-2-thione SMR000104433 | cid_792335
TypeSmall organic molecule
Emp. Form.C12H15NO2S3
Mol. Mass.301.448
SMILESCc1ccc(cc1)S(=O)(=O)N1C(=S)SCC1(C)C