Reaction Details
TargetMucolipin-3
LigandBDBM46858
Substrate/Competitorn/a
Meas. Tech.Dose response cell-based high-throughput screening assay for agonists of the transient receptor potential channel ML3 (TRPML3)
EC50 2260±n/a nM
Citation PubChem, PC Dose response cell-based high-throughput screening assay for agonists of the transient receptor potential channel ML3 (TRPML3) PubChem Bioassay(2009)[AID]
 
Mucolipin-3
Name:Mucolipin-3
Type:Enzyme Catalytic Domain
Mol. Mass.:64244.09
Organism:Homo sapiens (Human)
Description:Q8TDD5
Residue:553
BDBM46858
NameBDBM46858
Synonyms:1-methyl-3,6-dihydro-2H-pyridine-5-carboxylic acid methyl ester;hydrobromide ARECOLINE HYDROBROMIDE SMR000058258 cid_9301 | methyl 1-methyl-3,6-dihydro-2H-pyridine-5-carboxylate;hydrobromide
TypeSmall organic molecule
Emp. Form.C8H13NO2
Mol. Mass.155.1943
SMILESCOC(=O)C1=CCCN(C)C1