Reaction Details
TargetProcathepsin L
LigandBDBM31751
Substrate/Competitorn/a
Meas. Tech.Cathepsin L dose-response testing in the presence of cysteine
IC50 31205.21±4627.01 nM
Citation PubChem, PC Cathepsin L dose-response testing in the presence of cysteine PubChem Bioassay(2009)[AID]
 
Procathepsin L
Name:Procathepsin L
Type:Enzyme
Mol. Mass.:37557.19
Organism:Homo sapiens (Human)
Description:Purchased from Calbiochem (San Diego, CA).
Residue:333
BDBM31751
NameBDBM31751
Synonyms:3-[(2-chlorobenzyl)thio]-5,6-bis(2-furyl)-1,2,4-triazine 3-[(2-chlorophenyl)methylthio]-5,6-bis(2-furanyl)-1,2,4-triazine cid_6400942
TypeSmall organic molecule
Emp. Form.C18H12ClN3O2S
Mol. Mass.369.825
SMILESClc1ccccc1CSc1nnc(-c2ccco2)c(n1)-c1ccco1