Reaction Details
TargetPhosphotransferase
LigandBDBM34233
Substrate/Competitorn/a
Meas. Tech.HTS assay for inhibitors of Trypanosoma brucei hexokinase 1: IC50 determinations
IC50 900.853186±n/a nM
Citation PubChem, PC HTS assay for inhibitors of Trypanosoma brucei hexokinase 1: IC50 determinations PubChem Bioassay(2009)[AID]
 
Phosphotransferase
Name:Phosphotransferase
Synonyms:hexokinase
Type:Enzyme Catalytic Domain
Mol. Mass.:51160.00
Organism:Trypanosoma brucei
Description:gi_70832125
Residue:471
BDBM34233
NameBDBM34233
TypeSmall organic molecule
Emp. Form.C13H9NOSe
Mol. Mass.274.18
SMILESO=c1n([se]c2ccccc12)-c1ccccc1