Reaction Details
TargetPhosphotransferase
LigandBDBM10515
Substrate/Competitorn/a
Meas. Tech.HTS assay for inhibitors of Trypanosoma brucei hexokinase 1: IC50 determinations
IC50 200.810233±n/a nM
Citation PubChem, PC HTS assay for inhibitors of Trypanosoma brucei hexokinase 1: IC50 determinations PubChem Bioassay(2009)[AID]
 
Phosphotransferase
Name:Phosphotransferase
Synonyms:hexokinase
Type:Enzyme Catalytic Domain
Mol. Mass.:51160.00
Organism:Trypanosoma brucei
Description:gi_70832125
Residue:471
BDBM10515
NameBDBM10515
TypeSmall organic molecule
Emp. Form.C8H14O2S2
Mol. Mass.206.326
SMILESOC(=O)CCCCC1CCSS1