Reaction Details
TargetProtein-tyrosine kinase 2-beta
LigandBDBM40943
Substrate/Competitorn/a
Meas. Tech.TR-FRET counterscreen for FAK inhibitors: dose-response biochemical high throughput screening assay to identify inhibitors of Proline-rich tyrosine kinase 2 (Pyk2)
IC50>69500±n/a nM
Citation PubChem, PC TR-FRET counterscreen for FAK inhibitors: dose-response biochemical high throughput screening assay to identify inhibitors of Proline-rich tyrosine kinase 2 (Pyk2) PubChem Bioassay(2009)[AID]
 
Protein-tyrosine kinase 2-beta
Name:Protein-tyrosine kinase 2-beta
Type:Protein
Mol. Mass.:115868.80
Organism:Homo sapiens (Human)
Description:Q14289
Residue:1009
BDBM40943
NameBDBM40943
Synonyms:(2-Isopropyl-quinazolin-4-ylsulfanyl)-acetic acid methyl ester 2-[(2-propan-2-yl-4-quinazolinyl)thio]acetic acid methyl ester SMR000006837 methyl 2-(2-propan-2-ylquinazolin-4-yl)sulfanylacetate | methyl 2-(2-propan-2-ylquinazolin-4-yl)sulfanylethanoate
TypeSmall organic molecule
Emp. Form.C14H16N2O2S
Mol. Mass.276.354
SMILESCOC(=O)CSc1nc(nc2ccccc12)C(C)C