Reaction Details
TargetPhosphomannomutase 2
LigandBDBM34233
Substrate/Competitorn/a
Meas. Tech.Counter screen SAR assay for PMM2 inhibitors via a fluorescence intensity assay
IC50 672±n/a nM
Citation PubChem, PC Counter screen SAR assay for PMM2 inhibitors via a fluorescence intensity assay PubChem Bioassay(2010)[AID]
 
Phosphomannomutase 2
Name:Phosphomannomutase 2
Type:Enzyme Catalytic Domain
Mol. Mass.:28082.33
Organism:Homo sapiens (Human)
Description:gi_4557839
Residue:246
BDBM34233
NameBDBM34233
Synonyms:2-Phenyl-benzo[d]isoselenazol-3-one 2-phenyl-1,2-benzisoselazol-3(2H)-one 2-phenylbenzo[d][1,2]selenazol-3(2H)-one EBSELEN MLS000028488 cid_3194 | med.21724, Compound 153
TypeSmall organic molecule
Emp. Form.C13H9NOSe
Mol. Mass.274.18
SMILESO=c1n([se]c2ccccc12)-c1ccccc1