Reaction Details
TargetPhosphoethanolamine/phosphocholine phosphatase
LigandBDBM47032
Substrate/Competitorn/a
Meas. Tech.SAR assay for compounds that inhibit PHOSPHO1
IC50 434±n/a nM
Citation PubChem, PC SAR assay for compounds that inhibit PHOSPHO1 PubChem Bioassay(2010)[AID]
 
Phosphoethanolamine/phosphocholine phosphatase
Name:Phosphoethanolamine/phosphocholine phosphatase
Type:Enzyme Catalytic Domain
Mol. Mass.:29718.09
Organism:Homo sapiens (Human)
Description:Q8TCT1
Residue:267
BDBM47032
NameBDBM47032
Synonyms:2-[[3-methyl-4-(2,2,2-trifluoroethoxy)-2-pyridinyl]methylsulfinyl]-1H-benzimidazole 2-[[3-methyl-4-(2,2,2-trifluoroethoxy)pyridin-2-yl]methylsulfinyl]-1H-benzimidazole LANSOPRAZOLE US11903935, Compound IA-2 | cid_3883
TypeSmall organic molecule
Emp. Form.C16H14F3N3O2S
Mol. Mass.369.361
SMILESCc1c(OCC(F)(F)F)ccnc1CS(=O)c1nc2ccccc2[nH]1