Reaction Details
TargetSolute carrier family 12 member 5
LigandBDBM18864
Substrate/Competitorn/a
Meas. Tech.Identification of Novel Modulators of Cl- dependent Transport Process via HTS; Dose-dependent Assay with KCC2
EC50 4250±n/a nM
Citation PubChem, PC Identification of Novel Modulators of Cl- dependent Transport Process via HTS; Dose-dependent Assay with KCC2 PubChem Bioassay(2009)[AID]
 
Solute carrier family 12 member 5
Name:Solute carrier family 12 member 5
Type:PROTEIN
Mol. Mass.:126185.18
Organism:Homo sapiens (Human)
Description:ChEMBL_828024
Residue:1139
BDBM18864
NameBDBM18864
Synonyms:3-[4-(4-hydroxy-3-iodophenoxy)-3,5-diiodophenyl]propanoic acid cid_5804 | triiodothyropropionic acid, 5
TypeSmall organic molecule
Emp. Form.C15H11I3O4
Mol. Mass.635.9589
SMILESOC(=O)CCc1cc(I)c(Oc2ccc(O)c(I)c2)c(I)c1