Reaction Details
TargetSolute carrier family 12 member 5
LigandBDBM30857
Substrate/Competitorn/a
Meas. Tech.Identification of Novel Modulators of Cl- dependent Transport Process via HTS; Dose-dependent Assay with KCC2
EC50 23400±n/a nM
Citation PubChem, PC Identification of Novel Modulators of Cl- dependent Transport Process via HTS; Dose-dependent Assay with KCC2 PubChem Bioassay(2009)[AID]
 
Solute carrier family 12 member 5
Name:Solute carrier family 12 member 5
Type:PROTEIN
Mol. Mass.:126185.18
Organism:Homo sapiens (Human)
Description:ChEMBL_828024
Residue:1139
BDBM30857
NameBDBM30857
Synonyms:2-[(4-methoxy-1,3-benzothiazol-2-yl)amino]-4-methyl-5-thiazolecarboxylic acid ethyl ester MLS000045453 cid_3238591 | ethyl 2-[(4-methoxy-1,3-benzothiazol-2-yl)amino]-4-methyl-1,3-thiazole-5-carboxylate
TypeSmall organic molecule
Emp. Form.C15H15N3O3S2
Mol. Mass.349.428
SMILESCCOC(=O)c1sc(Nc2nc3c(OC)cccc3s2)nc1C