Reaction Details
TargetSolute carrier family 12 member 5
LigandBDBM41359
Substrate/Competitorn/a
Meas. Tech.Identification of Novel Modulators of Cl- dependent Transport Process via HTS; Dose-dependent Assay with KCC2
EC50 4930±n/a nM
Citation PubChem, PC Identification of Novel Modulators of Cl- dependent Transport Process via HTS; Dose-dependent Assay with KCC2 PubChem Bioassay(2009)[AID]
 
Solute carrier family 12 member 5
Name:Solute carrier family 12 member 5
Type:PROTEIN
Mol. Mass.:126185.18
Organism:Homo sapiens (Human)
Description:ChEMBL_828024
Residue:1139
BDBM41359
NameBDBM41359
Synonyms:MLS000118127 N-[3-[4-(2-fluorophenyl)piperazin-1-yl]propyl]-1,5-dimethyl-4-oxidanylidene-pyrrolo[3,2-c]quinoline-2-carboxamide N-[3-[4-(2-fluorophenyl)piperazino]propyl]-4-keto-1,5-dimethyl-pyrrolo[3,2-c]quinoline-2-carboxamide cid_5307606
TypeSmall organic molecule
Emp. Form.C27H30FN5O2
Mol. Mass.475.5578
SMILESCn1c(cc2c1c1ccccc1n(C)c2=O)C(=O)NCCCN1CCN(CC1)c1ccccc1F