Reaction Details
TargetRegulator of G-protein signaling 8
LigandBDBM34336
Substrate/Competitorn/a
Meas. Tech.Dose respone, multiplexed high-throughput screen for small molecule regulators of RGS family protein interactions, specifically RGS8-Galphao.
EC50 5080±n/a nM
Citation PubChem, PC Dose respone, multiplexed high-throughput screen for small molecule regulators of RGS family protein interactions, specifically RGS8-Galphao. PubChem Bioassay(2009)[AID]
 
Regulator of G-protein signaling 8
Name:Regulator of G-protein signaling 8
Type:Enzyme Catalytic Domain
Mol. Mass.:20925.80
Organism:Homo sapiens (Human)
Description:gi_74355113
Residue:180
BDBM34336
NameBDBM34336
Synonyms:2-(2-morpholin-4-yl-5-morpholin-4-ylsulfonyl-phenyl)-1,2-benzothiazol-3-one 2-(2-morpholino-5-morpholinosulfonyl-phenyl)-1,2-benzothiazol-3-one MLS000055722 cid_2325815
TypeSmall organic molecule
Emp. Form.C21H23N3O5S2
Mol. Mass.461.554
SMILESO=c1n(sc2ccccc12)-c1cc(ccc1N1CCOCC1)S(=O)(=O)N1CCOCC1