Reaction Details
TargetRegulator of G-protein signaling 8
LigandBDBM47714
Substrate/Competitorn/a
Meas. Tech.Dose respone, multiplexed high-throughput screen for small molecule regulators of RGS family protein interactions, specifically RGS8-Galphao.
EC50 5690±n/a nM
Citation PubChem, PC Dose respone, multiplexed high-throughput screen for small molecule regulators of RGS family protein interactions, specifically RGS8-Galphao. PubChem Bioassay(2009)[AID]
 
Regulator of G-protein signaling 8
Name:Regulator of G-protein signaling 8
Type:Enzyme Catalytic Domain
Mol. Mass.:20925.80
Organism:Homo sapiens (Human)
Description:gi_74355113
Residue:180
BDBM47714
NameBDBM47714
Synonyms:(2Z)-3-ethyl-2-[(2E,4E)-5-(3-ethyl-1,3-benzothiazol-3-ium-2-yl)penta-2,4-dienylidene]-1,3-benzothiazole;iodide Dithiazanine SMR000059184 | cid_5702697
TypeSmall organic molecule
Emp. Form.C23H23N2S2
Mol. Mass.391.572
SMILESCCN1\C(Sc2ccccc12)=C\C=C\C=C\c1sc2ccccc2[n+]1CC