Reaction Details
TargetRegulator of G-protein signaling 8
LigandBDBM47715
Substrate/Competitorn/a
Meas. Tech.Dose respone, multiplexed high-throughput screen for small molecule regulators of RGS family protein interactions, specifically RGS8-Galphao.
EC50 2290±n/a nM
Citation PubChem, PC Dose respone, multiplexed high-throughput screen for small molecule regulators of RGS family protein interactions, specifically RGS8-Galphao. PubChem Bioassay(2009)[AID]
 
Regulator of G-protein signaling 8
Name:Regulator of G-protein signaling 8
Type:Enzyme Catalytic Domain
Mol. Mass.:20925.80
Organism:Homo sapiens (Human)
Description:gi_74355113
Residue:180
BDBM47715
NameBDBM47715
Synonyms:DEFEROXAMINE MLS000028713 N-[5-[[4-[5-[acetyl(hydroxy)amino]pentylamino]-1,4-dioxobutyl]-hydroxyamino]pentyl]-N''-(5-aminopentyl)-N''-hydroxybutanediamide;methanesulfonic acid N-[5-[[4-[5-[acetyl(hydroxy)amino]pentylamino]-4-oxobutanoyl]-hydroxyamino]pentyl]-N''-(5-aminopentyl)-N''-hydroxybutanediamide;methanesulfonic acid cid_62881
TypeSmall organic molecule
Emp. Form.C25H48N6O8
Mol. Mass.560.684
SMILESCC(=O)N(O)CCCCCNC(=O)CCC(=O)N(O)CCCCCNC(=O)CCC(=O)N(O)CCCCCN