Reaction Details
TargetRegulator of G-protein signaling 8
LigandBDBM50292542
Substrate/Competitorn/a
Meas. Tech.Dose respone, multiplexed high-throughput screen for small molecule regulators of RGS family protein interactions, specifically RGS8-Galphao.
EC50 1750±n/a nM
Citation PubChem, PC Dose respone, multiplexed high-throughput screen for small molecule regulators of RGS family protein interactions, specifically RGS8-Galphao. PubChem Bioassay(2009)[AID]
 
Regulator of G-protein signaling 8
Name:Regulator of G-protein signaling 8
Type:Enzyme Catalytic Domain
Mol. Mass.:20925.80
Organism:Homo sapiens (Human)
Description:gi_74355113
Residue:180
BDBM50292542
NameBDBM50292542
Synonyms:(1R,19R,21S,22R,23R)-6,7,8,11,12,13,22,23-octahydroxy-3,16-dioxo-2,17,20-trioxatetracyclo[17.3.1.0^{4,9}.0^{10,15}]tricosa-4(9),5,7,10,12,14-hexaen-21-yl 3,4,5-trihydroxybenzoate cid_15944801
TypeSmall organic molecule
Emp. Form.C27H22O18
Mol. Mass.634.4528
SMILESO[C@@H]1[C@H]2COC(=O)c3cc(O)c(O)c(O)c3-c3c(O)c(O)c(O)cc3C(=O)O[C@H]1[C@@H](O)[C@H](OC(=O)c1cc(O)c(O)c(O)c1)O2