Reaction Details
TargetRegulator of G-protein signaling 8
LigandBDBM47816
Substrate/Competitorn/a
Meas. Tech.Dose respone, multiplexed high-throughput screen for small molecule regulators of RGS family protein interactions, specifically RGS8-Galphao.
EC50 4250±n/a nM
Citation PubChem, PC Dose respone, multiplexed high-throughput screen for small molecule regulators of RGS family protein interactions, specifically RGS8-Galphao. PubChem Bioassay(2009)[AID]
 
Regulator of G-protein signaling 8
Name:Regulator of G-protein signaling 8
Type:Enzyme Catalytic Domain
Mol. Mass.:20925.80
Organism:Homo sapiens (Human)
Description:gi_74355113
Residue:180
BDBM47816
NameBDBM47816
Synonyms:6-Oxo-6H-anthra[1,9-cd]isoxazole-3-carboxylic acid (3-methoxy-propyl)-amide SMR000425486 | cid_3729555
TypeSmall organic molecule
Emp. Form.C19H16N2O4
Mol. Mass.336.3413
SMILESCOCCCNC(=O)c1ccc2C(=O)c3ccccc3-c3onc1c23