Reaction Details
TargetRegulator of G-protein signaling 8
LigandBDBM25469
Substrate/Competitorn/a
Meas. Tech.Dose respone, multiplexed high-throughput screen for small molecule regulators of RGS family protein interactions, specifically RGS8-Galphao.
EC50 3060±n/a nM
Citation PubChem, PC Dose respone, multiplexed high-throughput screen for small molecule regulators of RGS family protein interactions, specifically RGS8-Galphao. PubChem Bioassay(2009)[AID]
 
Regulator of G-protein signaling 8
Name:Regulator of G-protein signaling 8
Type:Enzyme Catalytic Domain
Mol. Mass.:20925.80
Organism:Homo sapiens (Human)
Description:gi_74355113
Residue:180
BDBM25469
NameBDBM25469
Synonyms:2-[(7-nitro-2,1,3-benzoxadiazol-4-yl)sulfanyl]-1-oxidopyridin-1-ium cid_313619
TypeSmall organic molecule
Emp. Form.C11H6N4O4S
Mol. Mass.290.255
SMILES[O-][N+](=O)c1ccc(Sc2cccc[n+]2[O-])c2nonc12