Reaction Details
TargetRegulator of G-protein signaling 8
LigandBDBM47823
Substrate/Competitorn/a
Meas. Tech.Dose respone, multiplexed high-throughput screen for small molecule regulators of RGS family protein interactions, specifically RGS8-Galphao.
EC50 3420±n/a nM
Citation PubChem, PC Dose respone, multiplexed high-throughput screen for small molecule regulators of RGS family protein interactions, specifically RGS8-Galphao. PubChem Bioassay(2009)[AID]
 
Regulator of G-protein signaling 8
Name:Regulator of G-protein signaling 8
Type:Enzyme Catalytic Domain
Mol. Mass.:20925.80
Organism:Homo sapiens (Human)
Description:gi_74355113
Residue:180
BDBM47823
NameBDBM47823
Synonyms:MLS000757112 N-[2,5-bis(chloranyl)-3,6-bis(oxidanylidene)-4-(propanoylamino)cyclohexa-1,4-dien-1-yl]propanamide N-[2,5-dichloro-3,6-dioxo-4-(propanoylamino)cyclohexa-1,4-dien-1-yl]propanamide cid_323616
TypeSmall organic molecule
Emp. Form.C12H12Cl2N2O4
Mol. Mass.319.141
SMILESCCC(=O)NC1=C(Cl)C(=O)C(NC(=O)CC)=C(Cl)C1=O