Reaction Details
TargetRegulator of G-protein signaling 8
LigandBDBM47827
Substrate/Competitorn/a
Meas. Tech.Dose respone, multiplexed high-throughput screen for small molecule regulators of RGS family protein interactions, specifically RGS8-Galphao.
EC50 2050±n/a nM
Citation PubChem, PC Dose respone, multiplexed high-throughput screen for small molecule regulators of RGS family protein interactions, specifically RGS8-Galphao. PubChem Bioassay(2009)[AID]
 
Regulator of G-protein signaling 8
Name:Regulator of G-protein signaling 8
Type:Enzyme Catalytic Domain
Mol. Mass.:20925.80
Organism:Homo sapiens (Human)
Description:gi_74355113
Residue:180
BDBM47827
NameBDBM47827
Synonyms:1,12,23-trihydroxy-1,6,12,17,23,28-hexazacyclotritriacontane-2,5,13,16,24,27-hexone 1,12,23-tris(oxidanyl)-1,6,12,17,23,28-hexazacyclotritriacontane-2,5,13,16,24,27-hexone SMR000440583 | cid_161532
TypeSmall organic molecule
Emp. Form.C27H48N6O9
Mol. Mass.600.7048
SMILESON1CCCCCNC(=O)CCC(=O)N(O)CCCCCNC(=O)CCC(=O)N(O)CCCCCNC(=O)CCC1=O