Reaction Details
TargetRegulator of G-protein signaling 8
LigandBDBM47828
Substrate/Competitorn/a
Meas. Tech.Dose respone, multiplexed high-throughput screen for small molecule regulators of RGS family protein interactions, specifically RGS8-Galphao.
EC50 820±n/a nM
Citation PubChem, PC Dose respone, multiplexed high-throughput screen for small molecule regulators of RGS family protein interactions, specifically RGS8-Galphao. PubChem Bioassay(2009)[AID]
 
Regulator of G-protein signaling 8
Name:Regulator of G-protein signaling 8
Type:Enzyme Catalytic Domain
Mol. Mass.:20925.80
Organism:Homo sapiens (Human)
Description:gi_74355113
Residue:180
BDBM47828
NameBDBM47828
Synonyms:Chebulinic acid SMR000445569 | cid_16745534
TypeSmall organic molecule
Emp. Form.C41H32O27
Mol. Mass.956.6766
SMILES[H][C@@]12OC(=O)[C@@H](CC(O)=O)[C@]3([H])[C@H](O)C(=O)Oc4c(O)c(O)cc(c34)C(=O)O[C@]([H])([C@H](OC(=O)c3cc(O)c(O)c(O)c3)OC1COC(=O)c1cc(O)c(O)c(O)c1)[C@H]2OC(=O)c1cc(O)c(O)c(O)c1