Reaction Details
TargetRegulator of G-protein signaling 8
LigandBDBM33024
Substrate/Competitorn/a
Meas. Tech.Dose respone, multiplexed high-throughput screen for small molecule regulators of RGS family protein interactions, specifically RGS8-Galphao.
EC50 610±n/a nM
Citation PubChem, PC Dose respone, multiplexed high-throughput screen for small molecule regulators of RGS family protein interactions, specifically RGS8-Galphao. PubChem Bioassay(2009)[AID]
 
Regulator of G-protein signaling 8
Name:Regulator of G-protein signaling 8
Type:Enzyme Catalytic Domain
Mol. Mass.:20925.80
Organism:Homo sapiens (Human)
Description:gi_74355113
Residue:180
BDBM33024
NameBDBM33024
Synonyms:MLS000697664 SMR000445568 | cid_5388496
TypeSmall organic molecule
Emp. Form.C34H22O22
Mol. Mass.782.5253
SMILESOC1OC2COC(=O)c3cc(O)c(O)c(O)c3-c3c(O)c(O)c4oc(=O)c5c(c(O)c(O)c6oc(=O)c3c4c56)-c3c(O)c(O)c(O)cc3C(=O)OC2C(O)C1O