Reaction Details
TargetRegulator of G-protein signaling 7
LigandBDBM39255
Substrate/Competitorn/a
Meas. Tech.Dose response, multiplexed high-throughput screen for small molecule regulators of RGS family protein interactions, specifically RGS7-Galphao.
EC50>30000±n/a nM
Citation PubChem, PC Dose response, multiplexed high-throughput screen for small molecule regulators of RGS family protein interactions, specifically RGS7-Galphao. PubChem Bioassay(2009)[AID]
 
Regulator of G-protein signaling 7
Name:Regulator of G-protein signaling 7
Type:Enzyme Catalytic Domain
Mol. Mass.:57675.72
Organism:Homo sapiens (Human)
Description:P49802
Residue:495
BDBM39255
NameBDBM39255
Synonyms:MLS000063222 N-(2-chlorophenyl)-2-[(5-pyridin-4-yl-1,3,4-oxadiazol-2-yl)sulfanyl]ethanamide N-(2-chlorophenyl)-2-[[5-(4-pyridyl)-1,3,4-oxadiazol-2-yl]thio]acetamide SMR000074776 | cid_851257
TypeSmall organic molecule
Emp. Form.C15H11ClN4O2S
Mol. Mass.346.791
SMILESClc1ccccc1NC(=O)CSc1nnc(o1)-c1ccncc1