Reaction Details
TargetRegulator of G-protein signaling 7
LigandBDBM47707
Substrate/Competitorn/a
Meas. Tech.Dose response, multiplexed high-throughput screen for small molecule regulators of RGS family protein interactions, specifically RGS7-Galphao.
EC50>30000±n/a nM
Citation PubChem, PC Dose response, multiplexed high-throughput screen for small molecule regulators of RGS family protein interactions, specifically RGS7-Galphao. PubChem Bioassay(2009)[AID]
 
Regulator of G-protein signaling 7
Name:Regulator of G-protein signaling 7
Type:Enzyme Catalytic Domain
Mol. Mass.:57675.72
Organism:Homo sapiens (Human)
Description:P49802
Residue:495
BDBM47707
NameBDBM47707
Synonyms:4-(2-methylphenyl)-3-pyridin-4-yl-1H-1,2,4-triazole-5-thione 4-(o-tolyl)-3-(4-pyridyl)-1H-1,2,4-triazole-5-thione SMR000076548 | cid_969943
TypeSmall organic molecule
Emp. Form.C14H12N4S
Mol. Mass.268.337
SMILESCc1ccccc1-n1c(n[nH]c1=S)-c1ccncc1