Reaction Details
TargetRegulator of G-protein signaling 7
LigandBDBM34510
Substrate/Competitorn/a
Meas. Tech.Dose response, multiplexed high-throughput screen for small molecule regulators of RGS family protein interactions, specifically RGS7-Galphao.
EC50>30000±n/a nM
Citation PubChem, PC Dose response, multiplexed high-throughput screen for small molecule regulators of RGS family protein interactions, specifically RGS7-Galphao. PubChem Bioassay(2009)[AID]
 
Regulator of G-protein signaling 7
Name:Regulator of G-protein signaling 7
Type:Enzyme Catalytic Domain
Mol. Mass.:57675.72
Organism:Homo sapiens (Human)
Description:P49802
Residue:495
BDBM34510
NameBDBM34510
Synonyms:1-[2-(3-keto-4,6-dimethyl-isothiazolo[5,4-b]pyridin-2-yl)acetyl]nipecotic acid ethyl ester MLS000118886 cid_5308606 ethyl 1-[2-(4,6-dimethyl-3-oxo-[1,2]thiazolo[5,4-b]pyridin-2-yl)acetyl]piperidine-3-carboxylate
TypeSmall organic molecule
Emp. Form.C18H23N3O4S
Mol. Mass.377.458
SMILESCCOC(=O)C1CCCN(C1)C(=O)Cn1sc2nc(C)cc(C)c2c1=O