Reaction Details
TargetRegulator of G-protein signaling 7
LigandBDBM47718
Substrate/Competitorn/a
Meas. Tech.Dose response, multiplexed high-throughput screen for small molecule regulators of RGS family protein interactions, specifically RGS7-Galphao.
EC50>30000±n/a nM
Citation PubChem, PC Dose response, multiplexed high-throughput screen for small molecule regulators of RGS family protein interactions, specifically RGS7-Galphao. PubChem Bioassay(2009)[AID]
 
Regulator of G-protein signaling 7
Name:Regulator of G-protein signaling 7
Type:Enzyme Catalytic Domain
Mol. Mass.:57675.72
Organism:Homo sapiens (Human)
Description:P49802
Residue:495
BDBM47718
NameBDBM47718
Synonyms:2-[4-(3-Cyclohexyl-ureido)-phenyl]-3,3,3-trifluoro-2-hydroxy-propionic acid methyl ester 2-[4-[[(cyclohexylamino)-oxomethyl]amino]phenyl]-3,3,3-trifluoro-2-hydroxypropanoic acid methyl ester SMR000146480 methyl 2-[4-(cyclohexylcarbamoylamino)phenyl]-3,3,3-trifluoro-2-hydroxypropanoate | methyl 2-[4-(cyclohexylcarbamoylamino)phenyl]-3,3,3-tris(fluoranyl)-2-oxidanyl-propanoate
TypeSmall organic molecule
Emp. Form.C17H21F3N2O4
Mol. Mass.374.3548
SMILESCOC(=O)C(O)(c1ccc(NC(=O)NC2CCCCC2)cc1)C(F)(F)F