Reaction Details
TargetRegulator of G-protein signaling 7
LigandBDBM47719
Substrate/Competitorn/a
Meas. Tech.Dose response, multiplexed high-throughput screen for small molecule regulators of RGS family protein interactions, specifically RGS7-Galphao.
EC50>30000±n/a nM
Citation PubChem, PC Dose response, multiplexed high-throughput screen for small molecule regulators of RGS family protein interactions, specifically RGS7-Galphao. PubChem Bioassay(2009)[AID]
 
Regulator of G-protein signaling 7
Name:Regulator of G-protein signaling 7
Type:Enzyme Catalytic Domain
Mol. Mass.:57675.72
Organism:Homo sapiens (Human)
Description:P49802
Residue:495
BDBM47719
NameBDBM47719
Synonyms:(4-chlorodithiazol-5-ylidene)-(4-chloro-2-methyl-phenyl)amine 4-chloro-N-(4-chloro-2-methylphenyl)-5-dithiazolimine 4-chloro-N-(4-chloro-5H-1,2,3-dithiazol-5-yliden)-2-methylaniline SMR000125448 | cid_1471255
TypeSmall organic molecule
Emp. Form.C9H6Cl2N2S2
Mol. Mass.277.193
SMILESCc1cc(Cl)ccc1\N=c1\ssnc1Cl