Reaction Details
TargetRegulator of G-protein signaling 7
LigandBDBM47721
Substrate/Competitorn/a
Meas. Tech.Dose response, multiplexed high-throughput screen for small molecule regulators of RGS family protein interactions, specifically RGS7-Galphao.
EC50>30000±n/a nM
Citation PubChem, PC Dose response, multiplexed high-throughput screen for small molecule regulators of RGS family protein interactions, specifically RGS7-Galphao. PubChem Bioassay(2009)[AID]
 
Regulator of G-protein signaling 7
Name:Regulator of G-protein signaling 7
Type:Enzyme Catalytic Domain
Mol. Mass.:57675.72
Organism:Homo sapiens (Human)
Description:P49802
Residue:495
BDBM47721
NameBDBM47721
Synonyms:MLS000523066 N-[2-[6-[4-(2,5-dimethylphenyl)piperazine-1-carbonyl]-3-keto-4H-quinoxalin-2-yl]phenyl]acetamide N-[2-[6-[[4-(2,5-dimethylphenyl)-1-piperazinyl]-oxomethyl]-3-oxo-4H-quinoxalin-2-yl]phenyl]acetamide cid_9551426
TypeSmall organic molecule
Emp. Form.C29H29N5O3
Mol. Mass.495.5723
SMILESCC(=O)Nc1ccccc1-c1nc2ccc(cc2[nH]c1=O)C(=O)N1CCN(CC1)c1cc(C)ccc1C