Reaction Details
TargetRegulator of G-protein signaling 19
LigandBDBM41758
Substrate/Competitorn/a
Meas. Tech.Dose response, multiplexed high-throughput screen for small molecule regulators of RGS family protein interactions, specifically RGS19-Galphao.
EC50>30000±n/a nM
Citation PubChem, PC Dose response, multiplexed high-throughput screen for small molecule regulators of RGS family protein interactions, specifically RGS19-Galphao. PubChem Bioassay(2009)[AID]
 
Regulator of G-protein signaling 19
Name:Regulator of G-protein signaling 19
Type:Enzyme Catalytic Domain
Mol. Mass.:24631.38
Organism:Homo sapiens (Human)
Description:gi_86990435
Residue:217
BDBM41758
NameBDBM41758
Synonyms:(2-{2-[5-(4-Fluoro-phenyl)-[1,3,4]oxadiazol-2-ylsulfanyl]-acetylamino}-thiazol-4-yl)-acetic acid ethyl ester 2-[2-[[2-[[5-(4-fluorophenyl)-1,3,4-oxadiazol-2-yl]thio]acetyl]amino]thiazol-4-yl]acetic acid ethyl ester SMR000003120 ethyl 2-[2-[2-[[5-(4-fluorophenyl)-1,3,4-oxadiazol-2-yl]sulfanyl]ethanoylamino]-1,3-thiazol-4-yl]ethanoate | ethyl 2-[2-[[2-[[5-(4-fluorophenyl)-1,3,4-oxadiazol-2-yl]sulfanyl]acetyl]amino]-1,3-thiazol-4-yl]acetate
TypeSmall organic molecule
Emp. Form.C17H15FN4O4S2
Mol. Mass.422.454
SMILESCCOC(=O)Cc1csc(NC(=O)CSc2nnc(o2)-c2ccc(F)cc2)n1