Reaction Details
TargetRegulator of G-protein signaling 19
LigandBDBM47704
Substrate/Competitorn/a
Meas. Tech.Dose response, multiplexed high-throughput screen for small molecule regulators of RGS family protein interactions, specifically RGS19-Galphao.
EC50>30000±n/a nM
Citation PubChem, PC Dose response, multiplexed high-throughput screen for small molecule regulators of RGS family protein interactions, specifically RGS19-Galphao. PubChem Bioassay(2009)[AID]
 
Regulator of G-protein signaling 19
Name:Regulator of G-protein signaling 19
Type:Enzyme Catalytic Domain
Mol. Mass.:24631.38
Organism:Homo sapiens (Human)
Description:gi_86990435
Residue:217
BDBM47704
NameBDBM47704
Synonyms:2-[[3-(2,3-dihydro-1,4-benzodioxin-3-ylmethyl)-4-keto-quinazolin-2-yl]thio]acetic acid ethyl ester MLS000095253 cid_3240424 ethyl 2-[3-(2,3-dihydro-1,4-benzodioxin-3-ylmethyl)-4-oxoquinazolin-2-yl]sulfanylacetate | ethyl {[3-(2,3-dihydro-1,4-benzodioxin-2-ylmethyl)-4-oxo-3,4-dihydroquinazolin-2-yl]thio}acetate
TypeSmall organic molecule
Emp. Form.C21H20N2O5S
Mol. Mass.412.459
SMILESCCOC(=O)CSc1nc2ccccc2c(=O)n1CC1COc2ccccc2O1