Reaction Details
TargetRegulator of G-protein signaling 19
LigandBDBM47708
Substrate/Competitorn/a
Meas. Tech.Dose response, multiplexed high-throughput screen for small molecule regulators of RGS family protein interactions, specifically RGS19-Galphao.
EC50>30000±n/a nM
Citation PubChem, PC Dose response, multiplexed high-throughput screen for small molecule regulators of RGS family protein interactions, specifically RGS19-Galphao. PubChem Bioassay(2009)[AID]
 
Regulator of G-protein signaling 19
Name:Regulator of G-protein signaling 19
Type:Enzyme Catalytic Domain
Mol. Mass.:24631.38
Organism:Homo sapiens (Human)
Description:gi_86990435
Residue:217
BDBM47708
NameBDBM47708
Synonyms:1-(4-chlorobenzyl)sulfonylisonipecotic acid ethyl ester MLS000066348 cid_2228514 ethyl 1-[(4-chlorophenyl)methylsulfonyl]piperidine-4-carboxylate
TypeSmall organic molecule
Emp. Form.C15H20ClNO4S
Mol. Mass.345.842
SMILESCCOC(=O)C1CCN(CC1)S(=O)(=O)Cc1ccc(Cl)cc1