Reaction Details
TargetRegulator of G-protein signaling 19
LigandBDBM47734
Substrate/Competitorn/a
Meas. Tech.Dose response, multiplexed high-throughput screen for small molecule regulators of RGS family protein interactions, specifically RGS19-Galphao.
EC50 2200±n/a nM
Citation PubChem, PC Dose response, multiplexed high-throughput screen for small molecule regulators of RGS family protein interactions, specifically RGS19-Galphao. PubChem Bioassay(2009)[AID]
 
Regulator of G-protein signaling 19
Name:Regulator of G-protein signaling 19
Type:Enzyme Catalytic Domain
Mol. Mass.:24631.38
Organism:Homo sapiens (Human)
Description:gi_86990435
Residue:217
BDBM47734
NameBDBM47734
Synonyms:MLS000553854 N-[(8-Hydroxy-5-nitro-quinolin-7-yl)-p-tolyl-methyl]-propionamide N-[(8-hydroxy-5-nitro-7-quinolyl)-(p-tolyl)methyl]propionamide SMR000172089 | cid_2922056
TypeSmall organic molecule
Emp. Form.C20H19N3O4
Mol. Mass.365.3826
SMILESCCC(=O)NC(c1ccc(C)cc1)c1cc([N+]([O-])=O)c2cccnc2c1O