Reaction Details
TargetRegulator of G-protein signaling 19
LigandBDBM47776
Substrate/Competitorn/a
Meas. Tech.Dose response, multiplexed high-throughput screen for small molecule regulators of RGS family protein interactions, specifically RGS19-Galphao.
EC50 2180±n/a nM
Citation PubChem, PC Dose response, multiplexed high-throughput screen for small molecule regulators of RGS family protein interactions, specifically RGS19-Galphao. PubChem Bioassay(2009)[AID]
 
Regulator of G-protein signaling 19
Name:Regulator of G-protein signaling 19
Type:Enzyme Catalytic Domain
Mol. Mass.:24631.38
Organism:Homo sapiens (Human)
Description:gi_86990435
Residue:217
BDBM47776
NameBDBM47776
Synonyms:3-chloranyl-N-(3-morpholin-4-ylpropyl)-6-nitro-1-benzothiophene-2-carboxamide 3-chloro-N-(3-morpholinopropyl)-6-nitro-benzothiophene-2-carboxamide MLS000684370 cid_2225472
TypeSmall organic molecule
Emp. Form.C16H18ClN3O4S
Mol. Mass.383.85
SMILES[O-][N+](=O)c1ccc2c(Cl)c(sc2c1)C(=O)NCCCN1CCOCC1