Reaction Details
TargetRegulator of G-protein signaling 16
LigandBDBM34702
Substrate/Competitorn/a
Meas. Tech.Dose respone, multiplexed high-throughput screen for small molecule regulators of RGS family protein interactions, specifically RGS16-Galphao.
EC50 8810±n/a nM
Citation PubChem, PC Dose respone, multiplexed high-throughput screen for small molecule regulators of RGS family protein interactions, specifically RGS16-Galphao. PubChem Bioassay(2009)[AID]
 
Regulator of G-protein signaling 16
Name:Regulator of G-protein signaling 16
Type:Enzyme Catalytic Domain
Mol. Mass.:22748.87
Organism:Homo sapiens (Human)
Description:gi_156416009
Residue:202
BDBM34702
NameBDBM34702
Synonyms:(4E)-2,3-dihydroxy-4-[[(4-methyl-2-methylimino-1,3-thiazol-3-yl)amino]methylidene]cyclohexa-2,5-dien-1-one (4E)-2,3-dihydroxy-4-[[(4-methyl-2-methylimino-4-thiazolin-3-yl)amino]methylene]cyclohexa-2,5-dien-1-one (4Z)-2,3-dihydroxy-4-[[(4-methyl-2-methylimino-4-thiazolin-3-yl)amino]methylene]cyclohexa-2,5-dien-1-one SMR000151701 | cid_5834362
TypeSmall organic molecule
Emp. Form.C12H13N3O3S
Mol. Mass.279.315
SMILESCN=c1scc(C)n1N=Cc1ccc(O)c(O)c1O