Reaction Details
TargetRegulator of G-protein signaling 16
LigandBDBM47767
Substrate/Competitorn/a
Meas. Tech.Dose respone, multiplexed high-throughput screen for small molecule regulators of RGS family protein interactions, specifically RGS16-Galphao.
EC50>30000±n/a nM
Citation PubChem, PC Dose respone, multiplexed high-throughput screen for small molecule regulators of RGS family protein interactions, specifically RGS16-Galphao. PubChem Bioassay(2009)[AID]
 
Regulator of G-protein signaling 16
Name:Regulator of G-protein signaling 16
Type:Enzyme Catalytic Domain
Mol. Mass.:22748.87
Organism:Homo sapiens (Human)
Description:gi_156416009
Residue:202
BDBM47767
NameBDBM47767
Synonyms:3-(phenoxymethyl)-4-(phenylmethyl)-1H-1,2,4-triazole-5-thione 4-benzyl-5-(phenoxymethyl)-4H-1,2,4-triazole-3-thiol SMR000271129 | cid_702854
TypeSmall organic molecule
Emp. Form.C16H15N3OS
Mol. Mass.297.375
SMILESS=c1[nH]nc(COc2ccccc2)n1Cc1ccccc1