Reaction Details
TargetRegulator of G-protein signaling 16
LigandBDBM47779
Substrate/Competitorn/a
Meas. Tech.Dose respone, multiplexed high-throughput screen for small molecule regulators of RGS family protein interactions, specifically RGS16-Galphao.
EC50>30000±n/a nM
Citation PubChem, PC Dose respone, multiplexed high-throughput screen for small molecule regulators of RGS family protein interactions, specifically RGS16-Galphao. PubChem Bioassay(2009)[AID]
 
Regulator of G-protein signaling 16
Name:Regulator of G-protein signaling 16
Type:Enzyme Catalytic Domain
Mol. Mass.:22748.87
Organism:Homo sapiens (Human)
Description:gi_156416009
Residue:202
BDBM47779
NameBDBM47779
Synonyms:2-furanyl-[4-[3-(4-morpholinyl)-4-nitrophenyl]-1-piperazinyl]methanone MLS000711509 cid_2894898 furan-2-yl-[4-(3-morpholin-4-yl-4-nitrophenyl)piperazin-1-yl]methanone
TypeSmall organic molecule
Emp. Form.C19H22N4O5
Mol. Mass.386.4018
SMILES[O-][N+](=O)c1ccc(cc1N1CCOCC1)N1CCN(CC1)C(=O)c1ccco1