Reaction Details
TargetRegulator of G-protein signaling 16
LigandBDBM47782
Substrate/Competitorn/a
Meas. Tech.Dose respone, multiplexed high-throughput screen for small molecule regulators of RGS family protein interactions, specifically RGS16-Galphao.
EC50>30000±n/a nM
Citation PubChem, PC Dose respone, multiplexed high-throughput screen for small molecule regulators of RGS family protein interactions, specifically RGS16-Galphao. PubChem Bioassay(2009)[AID]
 
Regulator of G-protein signaling 16
Name:Regulator of G-protein signaling 16
Type:Enzyme Catalytic Domain
Mol. Mass.:22748.87
Organism:Homo sapiens (Human)
Description:gi_156416009
Residue:202
BDBM47782
NameBDBM47782
Synonyms:4-(2-methoxyphenyl)-3-phenyl-1H-1,2,4-triazole-5-thione SMR000283119 | cid_863515
TypeSmall organic molecule
Emp. Form.C15H13N3OS
Mol. Mass.283.348
SMILESCOc1ccccc1-n1c(n[nH]c1=S)-c1ccccc1