Reaction Details
TargetRegulator of G-protein signaling 16
LigandBDBM34972
Substrate/Competitorn/a
Meas. Tech.Dose respone, multiplexed high-throughput screen for small molecule regulators of RGS family protein interactions, specifically RGS16-Galphao.
EC50 11190±n/a nM
Citation PubChem, PC Dose respone, multiplexed high-throughput screen for small molecule regulators of RGS family protein interactions, specifically RGS16-Galphao. PubChem Bioassay(2009)[AID]
 
Regulator of G-protein signaling 16
Name:Regulator of G-protein signaling 16
Type:Enzyme Catalytic Domain
Mol. Mass.:22748.87
Organism:Homo sapiens (Human)
Description:gi_156416009
Residue:202
BDBM34972
NameBDBM34972
Synonyms:MLS000759648 N''-[(E)-(2,3-dihydroxy-4-oxocyclohexa-2,5-dien-1-ylidene)methyl]-2-(2-morpholin-4-yl-1,3-thiazol-4-yl)acetohydrazide N''-[(Z)-(2,3-dihydroxy-4-keto-cyclohexa-2,5-dien-1-ylidene)methyl]-2-(2-morpholinothiazol-4-yl)acetohydrazide N'-[(Z)-(2,3-dihydroxy-4-keto-cyclohexa-2,5-dien-1-ylidene)methyl]-2-(2-morpholinothiazol-4-yl)acetohydrazide cid_6508305
TypeSmall organic molecule
Emp. Form.C16H18N4O5S
Mol. Mass.378.403
SMILESOc1ccc(C=NNC(=O)Cc2csc(n2)N2CCOCC2)c(O)c1O