Reaction Details
TargetDual specificity protein phosphatase 3
LigandBDBM46209
Substrate/Competitorn/a
Meas. Tech.SAR VHR1 Fluorescent Assay for In Vitro dose response studies
IC50>99000±n/a nM
Citation PubChem, PC SAR VHR1 Fluorescent Assay for In Vitro dose response studies PubChem Bioassay(2009)[AID]
 
Dual specificity protein phosphatase 3
Name:Dual specificity protein phosphatase 3
Type:Hydrolase
Mol. Mass.:20480.58
Organism:Homo sapiens (Human)
Description:n/a
Residue:185
BDBM46209
NameBDBM46209
Synonyms:1-cyclopropyl-3-(4-sulfamoylphenyl)thiourea cid_891589
TypeSmall organic molecule
Emp. Form.C10H13N3O2S2
Mol. Mass.271.359
SMILESNS(=O)(=O)c1ccc(NC(=S)NC2CC2)cc1