Reaction Details
TargetDual specificity protein phosphatase 3
LigandBDBM46217
Substrate/Competitorn/a
Meas. Tech.SAR VHR1 Fluorescent Assay for In Vitro dose response studies
IC50>99000±n/a nM
Citation PubChem, PC SAR VHR1 Fluorescent Assay for In Vitro dose response studies PubChem Bioassay(2009)[AID]
 
Dual specificity protein phosphatase 3
Name:Dual specificity protein phosphatase 3
Type:Hydrolase
Mol. Mass.:20480.58
Organism:Homo sapiens (Human)
Description:n/a
Residue:185
BDBM46217
NameBDBM46217
Synonyms:2-(2-dibenzothiophenyloxy)-2-methylpropanoic acid 2-dibenzothiophen-2-yloxy-2-methyl-propionic acid MLS-0412044.0001 | cid_901652
TypeSmall organic molecule
Emp. Form.C16H14O3S
Mol. Mass.286.346
SMILESCC(C)(Oc1ccc2sc3ccccc3c2c1)C(O)=O